{"text_format":"1","workbook":"xlsx","n_sheets":24,"sheets":["Global Business Solutions","Sheet2","Scorecard","Targets & Inputs","Target - TMPS and NPAT","Ownership","NEI Calculator","Management","Employment Equity Worksheet","Employment Eq DATA INPUT","SD Table 1","SD Table 2","SD Table 3","SD Table 4","SD Table 5","SD Table 6","Skills Development","Procurement Recognition","Procurement Calculation","TMPS","ED & SD","Early Payments - ED","Early Payments - SD","Socio Economic Development"],"not_rendered":{"charts":0,"images":3,"macros":0,"external_links":0,"defined_names":113,"comments":0,"pivot_tables":0},"unopened":[],"bounds":{"document_bytes":16777216,"sheet_cells":100000,"rows_first":2000,"rows_last":500,"rows_between":2000,"halvings":0,"cell_chars":16384,"cell_head_chars":4096},"cells_cut":0,"cells_raw":0,"read":"whole","date_system":"1900"}

{"sheet":"Global Business Solutions","index":0,"n_rows":46,"n_cols":4,"rows_kept":46,"cut":false,"hidden":false,"merged":[[24,1,24,4],[26,1,26,4],[28,1,28,4],[30,0,30,1],[31,0,31,1],[32,0,32,1],[33,0,33,1],[35,0,35,1],[36,0,36,1],[37,0,37,1],[45,0,45,1],[43,0,43,1],[44,0,44,1],[38,0,38,1],[39,0,39,1],[40,0,40,1],[41,0,41,1],[42,0,42,1]]}
[]
[]
[]
[]
[]
[]
[]
[]
{"$rows_left_out":39}
{"sheet":"Sheet2","index":1,"n_rows":0,"n_cols":0,"rows_kept":0,"cut":false,"hidden":true,"merged":[]}

{"sheet":"Scorecard","index":2,"n_rows":87,"n_cols":11,"rows_kept":87,"cut":false,"hidden":false,"merged":[[49,6,50,6],[4,0,4,1],[0,1,0,4],[2,1,2,4],[30,6,35,6],[37,6,47,6],[6,6,13,6],[47,0,47,1],[46,0,46,1],[34,0,34,1],[15,6,28,6],[76,0,77,0],[76,1,77,2],[76,3,77,3],[57,0,57,5],[58,0,58,5],[59,0,59,5],[60,0,60,5],[61,0,61,5],[62,0,62,5],[69,0,69,5],[73,0,73,5],[63,0,63,5],[65,0,65,5],[67,0,67,5],[71,0,71,5],[6,9,13,9],[15,9,28,9],[30,9,35,9],[37,9,47,9],[49,9,50,9],[6,10,13,10],[15,10,28,10],[30,10,35,10],[37,10,47,10],[49,10,50,10]]}
["COMPANY NAME",{"$f":"'Global Business Solutions'!B27","v":"Test"}]
[]
["FINANCIAL INFORMATION USED",{"$f":"'Global Business Solutions'!B29","v":"2017-02-28"}]
[]
["GENERIC SCORECARD",null,"Performance","Score","Compliance Target","Target Score","Element Score","Verification Agency","Diff Per Verification Agency","Total per Verification Agency","Difference"]
[]
["Ownership",null,null,null,null,null,{"$f":"SUM(D8:D14)","v":0},null,null,{"$f":"SUM(H8:H14)","v":0},{"$f":"+G7-J7","v":0}]
["Voting Rights",null,{"$f":"+Ownership!D39","v":0},{"$f":"+Ownership!E39","v":0},"25% + 1 ",4,null,0,{"$f":"H8-D8","v":0}]
{"$rows_left_out":80}
{"sheet":"Targets & Inputs","index":3,"n_rows":182,"n_cols":10,"rows_kept":182,"cut":false,"hidden":false,"merged":[[159,0,159,1],[160,0,160,1],[161,0,161,1],[162,0,162,1],[147,0,147,1],[148,0,148,1],[158,0,158,1],[127,0,127,1],[128,0,128,1],[126,0,126,1],[16,0,16,1],[136,0,136,1],[24,0,24,1],[35,0,35,1],[36,0,36,1],[31,0,31,1],[32,0,32,1],[40,0,40,1],[12,0,12,1],[7,0,7,1],[22,0,22,1],[137,0,137,1],[132,0,132,1],[129,0,129,1],[43,0,43,1],[44,0,44,1],[46,0,46,1],[18,0,18,1],[112,0,112,1],[8,0,8,1],[9,0,9,1],[10,0,10,1],[13,0,13,1],[14,0,14,1],[0,1,0,8],[2,1,2,8],[83,0,83,1],[83,2,83,4],[83,5,83,7],[4,0,5,8],[17,0,17,1],[15,0,15,1],[19,0,19,1],[25,0,25,1],[30,2,30,4],[30,0,30,1],[30,5,30,7],[26,0,26,1],[41,0,41,1],[34,0,34,1],[112,5,112,7],[37,0,37,1],[39,0,39,1],[39,2,39,4],[112,2,112,4],[45,0,45,1],[102,0,102,1],[102,2,102,4],[102,5,102,7]]}
["COMPANY NAME",{"$f":"'Global Business Solutions'!B27","v":"Test"}]
[]
["FINANCIAL INFORMATION USED",{"$f":"'Global Business Solutions'!B29","v":"2017-02-28"}]
[]
["Targets & Input"]
[]
[]
["Input Information",null,"Budget","Actual"]
{"$rows_left_out":175}
{"sheet":"Target - TMPS and NPAT","index":4,"n_rows":49,"n_cols":5,"rows_kept":49,"cut":false,"hidden":false,"merged":[[0,1,0,4],[2,1,2,4],[4,0,6,4]]}
["COMPANY NAME",{"$f":"'Global Business Solutions'!B27","v":"Test"}]
[]
["FINANCIAL INFORMATION USED",{"$f":"'Global Business Solutions'!B29","v":"2017-02-28"}]
[]
["Target TMPS"]
[]
[]
[]
{"$rows_left_out":42}
{"sheet":"Ownership","index":5,"n_rows":46,"n_cols":23,"rows_kept":46,"cut":false,"hidden":false,"merged":[[34,1,34,11],[0,1,0,3],[2,1,2,3],[4,0,6,22],[8,1,8,12],[33,1,33,12]]}
["COMPANY NAME",{"$f":"'Target - TMPS and NPAT'!B1:E1","v":"Test"}]
[]
["FINANCIAL INFORMATION USED",{"$f":"'Target - TMPS and NPAT'!B3:E3","v":"2017-02-28"}]
[]
["Ownership"]
[]
[]
[]
{"$rows_left_out":39}
{"sheet":"NEI Calculator","index":6,"n_rows":39,"n_cols":9,"rows_kept":39,"cut":false,"hidden":false,"merged":[[8,0,8,8],[9,0,11,0],[9,3,9,8],[10,3,10,8],[11,3,11,8],[0,0,0,1],[0,2,0,5],[2,0,2,1],[2,2,2,5],[4,0,6,8],[20,3,20,8],[21,3,21,8],[15,0,15,8],[12,0,12,8],[13,3,13,8],[14,0,14,8],[16,0,21,0],[16,3,16,8],[17,3,17,8],[18,3,18,8],[19,3,19,8],[22,0,22,8],[23,3,23,8],[25,3,25,8],[26,3,26,8],[27,0,27,8],[28,3,28,8],[34,0,34,8],[35,3,35,8],[36,0,36,8],[38,0,38,1],[38,3,38,8],[33,3,33,8],[29,0,29,8],[30,0,30,8],[31,0,33,0],[31,3,31,8],[32,3,32,8]]}
["COMPANY NAME",null,{"$f":"+Ownership!B1","v":"Test"}]
[]
["FINANCIAL INFORMATION USED",null,{"$f":"+Ownership!B3","v":"2017-02-28"}]
[]
["NEI Calculator"]
[]
[]
[]
{"$rows_left_out":32}
{"sheet":"Management","index":7,"n_rows":64,"n_cols":28,"rows_kept":64,"cut":false,"hidden":false,"merged":[[0,1,0,4],[2,1,2,4],[8,0,9,0],[4,0,6,27],[8,12,8,19],[8,4,8,11],[8,20,8,27]]}
["  ",{"$f":"'Global Business Solutions'!B27","v":"Test"}]
[]
["FINANCIAL INFORMATION USED",{"$f":"'Global Business Solutions'!B29","v":"2017-02-28"}]
[]
["Management"]
[]
[]
[]
{"$rows_left_out":57}
{"sheet":"Employment Equity Worksheet","index":8,"n_rows":115,"n_cols":14,"rows_kept":115,"cut":false,"hidden":false,"merged":[[103,1,104,1],[8,0,9,0],[8,1,8,5],[8,6,8,10],[4,0,6,11],[0,1,0,4],[2,1,2,4],[75,1,75,6],[89,1,89,6]]}
["COMPANY NAME",{"$f":"'Global Business Solutions'!B27","v":"Test"}]
[]
["FINANCIAL INFORMATION USED",{"$f":"'Global Business Solutions'!B29","v":"2017-02-28"}]
[]
["Employment Equity "]
[]
[]
[]
{"$rows_left_out":108}
{"sheet":"Employment Eq DATA INPUT","index":9,"n_rows":33,"n_cols":73,"rows_kept":33,"cut":false,"hidden":false,"merged":[[0,2,0,5],[2,2,2,5],[4,0,6,72],[10,64,10,72],[10,46,10,54],[10,10,10,18],[10,28,10,36],[10,37,10,45],[10,55,10,63],[10,19,10,27],[8,2,9,8]]}
["COMPANY NAME",null,{"$f":"'Global Business Solutions'!B27","v":"Test"}]
[]
["FINANCIAL INFORMATION USED",null,{"$f":"'Global Business Solutions'!B29","v":"2017-02-28"}]
[]
["Employment Equity Data"]
[]
[]
[]
{"$rows_left_out":26}
{"sheet":"SD Table 1","index":10,"n_rows":46,"n_cols":61,"rows_kept":46,"cut":false,"hidden":false,"merged":[]}
["COMPANY NAME",{"$f":"'Global Business Solutions'!B27","v":"Test"}]
[]
["FINANCIAL INFORMATION USED",{"$f":"'Global Business Solutions'!B29","v":"2017-02-28"}]
[]
["Skills Development Table 1",null,"Please only complete table with information for the periods reflected alongside",null,null,null,null,null,null,null,null,null,null,null,null,null,"Note: These training costs reflected must exclude VAT as well as the salaries of all Learners employed during the period under review. The salaries of the Learners must be completed in SD Table 2"]
[]
[]
[]
{"$rows_left_out":39}
{"sheet":"SD Table 2","index":11,"n_rows":35,"n_cols":25,"rows_kept":35,"cut":false,"hidden":false,"merged":[]}
["COMPANY NAME",{"$f":"'Global Business Solutions'!B27","v":"Test"}]
[]
["FINANCIAL INFORMATION USED",{"$f":"'Global Business Solutions'!B29","v":"2017-02-28"}]
[]
["Skills Development Table 2",null,"Please only complete table with actual remuneration (TCOE/TCTC) paid to the learner for the periods reflected alongside",null,null,{"$f":"IF('Skills Development'!$B11>0,'Skills Development'!$A11,\"\")","v":""},{"$f":"IF('Skills Development'!$B14>0,'Skills Development'!$A14,\"\")","v":""},{"$f":"IF('Skills Development'!$B17>0,'Skills Development'!$A17,\"\")","v":""},{"$f":"IF('Skills Development'!$B20>0,'Skills Development'!$A20,\"\")","v":""},"Please only reflect details pertaining to the Black Learners employed and/or hosted by your entity"]
[null,null,null,null,null,{"$f":"IF('Skills Development'!$B12>0,'Skills Development'!$A12,\"\")","v":""},{"$f":"IF('Skills Development'!$B15>0,'Skills Development'!$A15,\"\")","v":""},{"$f":"IF('Skills Development'!$B18>0,'Skills Development'!$A18,\"\")","v":""},{"$f":"IF('Skills Development'!$B21>0,'Skills Development'!$A21,\"\")","v":""}]
[null,null,null,null,null,{"$f":"IF('Skills Development'!$B13>0,'Skills Development'!$A13,\"\")","v":""},{"$f":"IF('Skills Development'!$B16>0,'Skills Development'!$A16,\"\")","v":""},{"$f":"IF('Skills Development'!$B19>0,'Skills Development'!$A19,\"\")","v":""},{"$f":"IF('Skills Development'!$B22>0,'Skills Development'!$A22,\"\")","v":""},"Please refer to the Learning Program Matrix  for a full explanation as to the different types of Learnerships reflected. "]
[]
{"$rows_left_out":28}
{"sheet":"SD Table 3","index":12,"n_rows":33,"n_cols":23,"rows_kept":33,"cut":false,"hidden":false,"merged":[[9,6,11,6],[9,7,11,7],[9,0,11,0],[9,1,10,1],[9,2,10,2],[9,3,10,3],[9,4,10,4],[0,1,0,4],[2,1,2,4],[9,5,11,5],[4,0,6,1],[4,2,6,4],[9,20,11,20],[9,21,11,21],[9,22,11,22],[9,11,11,11],[9,12,11,12],[9,13,11,13],[9,14,11,14],[9,15,11,15],[9,16,11,16],[9,17,11,17],[9,19,11,19],[9,18,11,18]]}
["COMPANY NAME",{"$f":"'Global Business Solutions'!B27","v":"Test"}]
[]
["FINANCIAL INFORMATION USED",{"$f":"'Global Business Solutions'!B29","v":"2017-02-28"}]
[]
["Skills Development Table 3",null,"Please only complete table with payments/disbursements during the periods reflected alongside",null,{"$f":"IF('Skills Development'!$B11>0,'Skills Development'!$A11,\"\")","v":""},{"$f":"IF('Skills Development'!$B14>0,'Skills Development'!$A14,\"\")","v":""},{"$f":"IF('Skills Development'!$B17>0,'Skills Development'!$A17,\"\")","v":""},{"$f":"IF('Skills Development'!$B20>0,'Skills Development'!$A20,\"\")","v":""},"Please only reflect details pertaining to bursary holders who are Black and who are employed by your entity"]
[null,null,null,null,{"$f":"IF('Skills Development'!$B12>0,'Skills Development'!$A12,\"\")","v":""},{"$f":"IF('Skills Development'!$B15>0,'Skills Development'!$A15,\"\")","v":""},{"$f":"IF('Skills Development'!$B18>0,'Skills Development'!$A18,\"\")","v":""},{"$f":"IF('Skills Development'!$B21>0,'Skills Development'!$A21,\"\")","v":""}]
[null,null,null,null,{"$f":"IF('Skills Development'!$B13>0,'Skills Development'!$A13,\"\")","v":""},{"$f":"IF('Skills Development'!$B16>0,'Skills Development'!$A16,\"\")","v":""},{"$f":"IF('Skills Development'!$B19>0,'Skills Development'!$A19,\"\")","v":""},{"$f":"IF('Skills Development'!$B22>0,'Skills Development'!$A22,\"\")","v":""}]
["Bursaries are defined as any tertiary studies undertaken that is subject to an agreement signed by the employee"]
{"$rows_left_out":26}
{"sheet":"SD Table 4","index":13,"n_rows":33,"n_cols":17,"rows_kept":33,"cut":false,"hidden":false,"merged":[[18,16,18,18],[8,16,8,18],[9,16,9,18],[10,16,10,18],[11,16,11,18],[28,1,28,6],[28,7,28,12],[0,1,0,5],[2,1,2,5],[4,0,6,13],[24,1,24,6],[24,7,24,12]]}
["COMPANY NAME",{"$f":"'Global Business Solutions'!B27","v":"Test"}]
[]
["FINANCIAL INFORMATION USED",{"$f":"'Global Business Solutions'!B29","v":"2017-02-28"}]
[]
["Skills Development Table 4"]
[]
[]
[]
{"$rows_left_out":26}
{"sheet":"SD Table 5","index":14,"n_rows":35,"n_cols":15,"rows_kept":35,"cut":false,"hidden":false,"merged":[[8,13,10,13],[8,14,10,14],[8,9,10,9],[8,10,10,10],[8,11,10,11],[8,12,10,12]]}
["COMPANY NAME",{"$f":"'Global Business Solutions'!B27","v":"Test"}]
[]
["FINANCIAL INFORMATION USED",{"$f":"'Global Business Solutions'!B29","v":"2017-02-28"}]
[]
["Skills Development Table 5"]
[]
[]
[]
{"$rows_left_out":28}
{"sheet":"SD Table 6","index":15,"n_rows":35,"n_cols":10,"rows_kept":35,"cut":false,"hidden":false,"merged":[]}
["COMPANY NAME",{"$f":"'Global Business Solutions'!B27","v":"Test"}]
[]
["FINANCIAL INFORMATION USED",{"$f":"'Global Business Solutions'!B29","v":"2017-02-28"}]
[]
["Skills Development Table 6"]
[]
[]
[]
{"$rows_left_out":28}
{"sheet":"Skills Development","index":16,"n_rows":83,"n_cols":15,"rows_kept":83,"cut":false,"hidden":false,"merged":[[0,1,0,8],[2,1,2,8],[4,0,6,14],[24,2,24,4],[24,5,24,7],[24,8,24,10],[24,11,24,13],[55,8,55,10],[55,11,55,13],[57,0,57,1],[81,0,81,1],[43,2,43,4],[43,5,43,7],[52,0,52,1],[53,0,53,1],[49,8,49,9],[44,8,44,10],[50,8,50,9],[59,0,59,1],[66,0,66,1],[67,0,67,1],[55,2,55,4],[55,5,55,7]]}
["COMPANY NAME",{"$f":"'Global Business Solutions'!B27","v":"Test"}]
[]
["FINANCIAL INFORMATION USED",{"$f":"'Global Business Solutions'!B29","v":"2017-02-28"}]
[]
["Skills Development Working Paper "]
[]
[]
[]
{"$rows_left_out":76}
{"sheet":"Procurement Recognition","index":17,"n_rows":35,"n_cols":29,"rows_kept":35,"cut":false,"hidden":false,"merged":[]}
["Client Name",{"$f":"'Global Business Solutions'!B27","v":"Test"}]
[]
["FINANCIAL INFORMATION USED",{"$f":"'Global Business Solutions'!B29","v":"2017-02-28"}]
[]
["Preferential Procurement                    "]
["Details of BEE suppliers"]
["Measurement period",{"$f":"+C7-364","v":"2016-03-01"},{"$f":"+B3","v":"2017-02-28"}]
["Supplier Name","Supplier Code","Expiry Date","Currency","Comments","Classification ",null,null,null,null,"Level Contribution Status (0 to 9)","BEE Recognition Level","Level 9 Exclusions","Exclusions Total","Total Procurement Spend","Total Procurement Spend - Last Financial Year","SD beneficiary with 3 yr contract","Black EME/QSE (Non SD) with 3 yr contract","First time suppplier","Supplier an Empowering Supplier?","Supplier Greater than 51% Black Owned?",null,"Supplier Greater than 30% Black Women Owned?",null,">51% black owned & Designated Group Supplier ",null,"Proof of BEE Status Available for Inspection?","Recognised Procurement"]
{"$rows_left_out":28}
{"sheet":"Procurement Calculation","index":18,"n_rows":28,"n_cols":6,"rows_kept":28,"cut":false,"hidden":false,"merged":[[4,0,4,5],[0,1,0,4],[2,1,2,4],[22,0,22,1],[23,0,23,1],[21,0,21,1],[15,0,15,1],[16,0,16,1],[17,0,17,1],[19,0,20,0],[18,0,18,1]]}
["COMPANY NAME",{"$f":"'Global Business Solutions'!B27","v":"Test"}]
[]
["FINANCIAL INFORMATION USED",{"$f":"'Global Business Solutions'!B29","v":"2017-02-28"}]
[]
["Preferential Procurement                    "]
[]
["Total Measured Procurement Spend",{"$f":"TMPS!D18","v":0}]
["Recognised Procurement",{"$f":"'Procurement Recognition'!AB33","v":0}]
{"$rows_left_out":21}
{"sheet":"TMPS","index":19,"n_rows":52,"n_cols":4,"rows_kept":52,"cut":false,"hidden":false,"merged":[[0,1,0,4],[2,1,2,4],[4,0,6,4]]}
["COMPANY NAME",{"$f":"'Global Business Solutions'!B27","v":"Test"}]
[]
["FINANCIAL INFORMATION USED",{"$f":"'Global Business Solutions'!B29","v":"2017-02-28"}]
[]
["TMPS & NPAT"]
[]
[]
[]
{"$rows_left_out":45}
{"sheet":"ED & SD","index":20,"n_rows":89,"n_cols":15,"rows_kept":89,"cut":false,"hidden":false,"merged":[[30,8,30,10],[11,8,11,10],[0,1,0,4],[2,1,2,4],[4,0,6,14],[8,8,8,10],[9,8,9,10],[10,8,10,10],[12,8,12,10],[13,8,13,10],[14,8,14,10],[15,8,15,10],[16,8,16,10],[17,8,17,10],[18,8,18,10],[19,8,19,10],[20,8,20,10],[21,8,21,10],[22,8,22,10],[23,8,23,10],[24,8,24,10],[25,8,25,10],[26,8,26,10],[27,8,27,10],[28,8,28,10],[29,8,29,10]]}
["COMPANY NAME",{"$f":"'Global Business Solutions'!B27","v":"Test"}]
[]
["FINANCIAL INFORMATION USED",{"$f":"'Global Business Solutions'!B29","v":"2017-02-28"}]
[]
["Enterprise Development "]
[]
[]
[]
{"$rows_left_out":82}
{"sheet":"Early Payments - ED","index":21,"n_rows":24,"n_cols":10,"rows_kept":24,"cut":false,"hidden":false,"merged":[[0,1,0,4],[2,1,2,4],[4,0,6,9]]}
["COMPANY NAME",{"$f":"'Global Business Solutions'!B27","v":"Test"}]
[]
["FINANCIAL INFORMATION USED",{"$f":"'Global Business Solutions'!B29","v":"2017-02-28"}]
[]
["Enterprise Development - Early Payments Schedule"]
[]
[]
[]
{"$rows_left_out":17}
{"sheet":"Early Payments - SD","index":22,"n_rows":37,"n_cols":10,"rows_kept":37,"cut":false,"hidden":false,"merged":[[0,1,0,4],[2,1,2,4],[4,0,6,9]]}
["COMPANY NAME",{"$f":"'Global Business Solutions'!B27","v":"Test"}]
[]
["FINANCIAL INFORMATION USED",{"$f":"'Global Business Solutions'!B29","v":"2017-02-28"}]
[]
["Supplier Development - Early Payments Schedule"]
[]
[]
[]
{"$rows_left_out":30}
{"sheet":"Socio Economic Development","index":23,"n_rows":45,"n_cols":9,"rows_kept":45,"cut":false,"hidden":false,"merged":[[0,1,0,4],[2,1,2,4],[4,0,6,8]]}
["COMPANY NAME",{"$f":"'Global Business Solutions'!B27","v":"Test"}]
[]
["FINANCIAL INFORMATION USED",{"$f":"'Global Business Solutions'!B29","v":"2017-02-28"}]
[]
["Socio Economic Development "]
[]
[]
[]
{"$rows_left_out":37}